Reaction Details
TargetCoagulation factor X
LigandBDBM50124972
Substrate/Competitorn/a
Meas. Tech.ChEMBL_48999 (CHEMBL662880)
Ki 2.7±n/a nM
Citation Huang, WNaughton, MAYang, HSu, TDam, SWong, PWArfsten, AEdwards, SSinha, UHollenbach, SScarborough, RMZhu, BY Design, synthesis, and structure-activity relationships of unsubstituted piperazinone-based transition state factor Xa inhibitors. Bioorg Med Chem Lett13:723-8 (2003) Coagulation factor X
Name:Coagulation factor X
Type:Enzyme
Mol. Mass.:54726.60
Organism:Homo sapiens (Human)
Description:n/a
Residue:488
BDBM50124972
NameBDBM50124972
Synonyms:CHEMBL163174 | N-[4-Guanidino-1-(thiazole-2-carbonyl)-butyl]-2-[4-(naphthalene-2-sulfonyl)-2-oxo-piperazin-1-yl]-acetamide
TypeSmall organic molecule
Emp. Form.C25H29N7O5S2
Mol. Mass.571.672
SMILESNC(=N)NCCCC(NC(=O)CN1CCN(CC1=O)S(=O)(=O)c1ccc2ccccc2c1)C(=O)c1nccs1