Reaction Details
TargetCoagulation factor X
LigandBDBM50125013
Substrate/Competitorn/a
Meas. Tech.ChEBML_49131
IC50 0.890000±n/a nM
Citation Huang, WNaughton, MAYang, HSu, TDam, SWong, PWArfsten, AEdwards, SSinha, UHollenbach, SScarborough, RMZhu, BY Design, synthesis, and structure-activity relationships of unsubstituted piperazinone-based transition state factor Xa inhibitors. Bioorg Med Chem Lett13:723-8 (2003) Coagulation factor X
Name:Coagulation factor X
Type:Enzyme
Mol. Mass.:54726.60
Organism:Homo sapiens (Human)
Description:n/a
Residue:488
BDBM50125013
NameBDBM50125013
Synonyms:CHEMBL406940 | N-[4-Guanidino-1-(thiazole-2-carbonyl)-butyl]-2-[4-(4-methoxy-benzenesulfonyl)-2-oxo-piperazin-1-yl]-acetamide
TypeSmall organic molecule
Emp. Form.C22H29N7O6S2
Mol. Mass.551.639
SMILESCOc1ccc(cc1)S(=O)(=O)N1CCN(CC(=O)NC(CCCNC(N)=N)C(=O)c2nccs2)C(=O)C1