Reaction Details
TargetSigma non-opioid intracellular receptor 1
LigandBDBM50125092
Substrate/Competitorn/a
Meas. Tech.ChEBML_202046
Ki 0.390000±n/a nM
Citation Foster, AWu, HChen, WWilliams, WBowen, WDMatsumoto, RRCoop, A 1,4-dibenzylpiperazines possess anticocaine activity. Bioorg Med Chem Lett13:749-51 (2003) Sigma non-opioid intracellular receptor 1
Name:Sigma non-opioid intracellular receptor 1
Type:Enzyme Catalytic Domain
Mol. Mass.:25124.85
Organism:Homo sapiens (Human)
Description:Q99720
Residue:223
BDBM50125092
NameBDBM50125092
Synonyms:1-Benzyl-4-(3-methoxy-benzyl)-piperazine | CHEMBL165848
TypeSmall organic molecule
Emp. Form.C19H24N2O
Mol. Mass.296.4067
SMILESCOc1cccc(CN2CCN(Cc3ccccc3)CC2)c1