Reaction Details
TargetSigma non-opioid intracellular receptor 1
LigandBDBM50125098
Substrate/Competitorn/a
Meas. Tech.ChEBML_202046
Ki 0.460000±n/a nM
Citation Foster, AWu, HChen, WWilliams, WBowen, WDMatsumoto, RRCoop, A 1,4-dibenzylpiperazines possess anticocaine activity. Bioorg Med Chem Lett13:749-51 (2003) Sigma non-opioid intracellular receptor 1
Name:Sigma non-opioid intracellular receptor 1
Type:Enzyme Catalytic Domain
Mol. Mass.:25124.85
Organism:Homo sapiens (Human)
Description:Q99720
Residue:223
BDBM50125098
NameBDBM50125098
Synonyms:1-Benzyl-4-(3-chloro-benzyl)-piperazine | CHEMBL164124
TypeSmall organic molecule
Emp. Form.C18H21ClN2
Mol. Mass.300.826
SMILESClc1cccc(CN2CCN(Cc3ccccc3)CC2)c1