Reaction Details
TargetD(2) dopamine receptor
LigandBDBM50125154
Substrate/Competitorn/a
Meas. Tech.ChEBML_61123
Ki 5.2±n/a nM
Citation Lee, TRobichaud, AJBoyle, KELu, YRobertson, DWMiller, KJFitzgerald, LWMcElroy, JFLargent, BL Novel, highly potent, selective 5-HT2A/D2 receptor antagonists as potential atypical antipsychotics. Bioorg Med Chem Lett13:767-70 (2003) D(2) dopamine receptor
Name:D(2) dopamine receptor
Type:Cell-surface receptors
Mol. Mass.:50647.10
Organism:Homo sapiens (Human)
Description:P14416
Residue:443
BDBM50125154
NameBDBM50125154
Synonyms:1-(2-Amino-4-fluoro-phenyl)-4-(7aS,11aR)-5,6,8,9,11,11a-hexahydro-4H,7aH-pyrido[3',4':4,5]pyrrolo[3,2,1-ij]quinolin-10-yl-butan-1-one | CHEMBL351592
TypeSmall organic molecule
Emp. Form.C24H28FN3O
Mol. Mass.393.497
SMILESNc1cc(F)ccc1C(=O)CCCN1CC[C@H]2[C@@H](C1)c1cccc3CCCN2c13