Reaction Details
TargetD(2) dopamine receptor
LigandBDBM50125155
Substrate/Competitorn/a
Meas. Tech.ChEBML_61123
Ki 2.3±n/a nM
Citation Lee, TRobichaud, AJBoyle, KELu, YRobertson, DWMiller, KJFitzgerald, LWMcElroy, JFLargent, BL Novel, highly potent, selective 5-HT2A/D2 receptor antagonists as potential atypical antipsychotics. Bioorg Med Chem Lett13:767-70 (2003) D(2) dopamine receptor
Name:D(2) dopamine receptor
Type:Cell-surface receptors
Mol. Mass.:50647.10
Organism:Homo sapiens (Human)
Description:P14416
Residue:443
BDBM50125155
NameBDBM50125155
Synonyms:1-(2-Amino-4-fluoro-phenyl)-4-(6bR,10aS)-1,2,6b,9,10,10a-hexahydro-7H-3-oxa-8,10b-diaza-fluoranthen-8-yl-butan-1-one | CHEMBL165780
TypeSmall organic molecule
Emp. Form.C23H26FN3O2
Mol. Mass.395.4698
SMILESNc1cc(F)ccc1C(=O)CCCN1CC[C@H]2[C@@H](C1)c1cccc3OCCN2c13