Reaction Details
Target5-hydroxytryptamine receptor 2A
LigandBDBM50125160
Substrate/Competitorn/a
Meas. Tech.ChEBML_2457
Ki 2.8±n/a nM
Citation Lee, TRobichaud, AJBoyle, KELu, YRobertson, DWMiller, KJFitzgerald, LWMcElroy, JFLargent, BL Novel, highly potent, selective 5-HT2A/D2 receptor antagonists as potential atypical antipsychotics. Bioorg Med Chem Lett13:767-70 (2003) 5-hydroxytryptamine receptor 2A
Name:5-hydroxytryptamine receptor 2A
Type:undefined
Mol. Mass.:52607.65
Organism:Homo sapiens (Human)
Description:P28223
Residue:471
BDBM50125160
NameBDBM50125160
Synonyms:1-(2-Amino-4-fluoro-phenyl)-4-(6bS,10aR)-1,2,6b,9,10,10a-hexahydro-7H-3-oxa-8,10b-diaza-fluoranthen-8-yl-butan-1-one | CHEMBL349057
TypeSmall organic molecule
Emp. Form.C23H26FN3O2
Mol. Mass.395.4698
SMILESNc1cc(F)ccc1C(=O)CCCN1CC[C@@H]2[C@H](C1)c1cccc3OCCN2c13