Reaction Details
TargetD(2) dopamine receptor
LigandBDBM50125158
Substrate/Competitorn/a
Meas. Tech.ChEBML_61123
Ki 4.7±n/a nM
Citation Lee, TRobichaud, AJBoyle, KELu, YRobertson, DWMiller, KJFitzgerald, LWMcElroy, JFLargent, BL Novel, highly potent, selective 5-HT2A/D2 receptor antagonists as potential atypical antipsychotics. Bioorg Med Chem Lett13:767-70 (2003) D(2) dopamine receptor
Name:D(2) dopamine receptor
Type:Cell-surface receptors
Mol. Mass.:50647.10
Organism:Homo sapiens (Human)
Description:P14416
Residue:443
BDBM50125158
NameBDBM50125158
Synonyms:1-(2-Amino-4-bromo-phenyl)-4-(7bS,11aR)-6,7,8,9,11,11a-hexahydro-5H,7bH-4-thia-7a,10-diaza-cyclohepta[jk]fluoren-10-yl-butan-1-one | CHEMBL352182
TypeSmall organic molecule
Emp. Form.C24H28BrN3OS
Mol. Mass.486.468
SMILESNc1cc(Br)ccc1C(=O)CCCN1CC[C@H]2[C@@H](C1)c1cccc3SCCCN2c13