Reaction Details
Target5-hydroxytryptamine receptor 2A
LigandBDBM50125150
Substrate/Competitorn/a
Meas. Tech.ChEBML_2457
Ki 0.900000±n/a nM
Citation Lee, TRobichaud, AJBoyle, KELu, YRobertson, DWMiller, KJFitzgerald, LWMcElroy, JFLargent, BL Novel, highly potent, selective 5-HT2A/D2 receptor antagonists as potential atypical antipsychotics. Bioorg Med Chem Lett13:767-70 (2003) 5-hydroxytryptamine receptor 2A
Name:5-hydroxytryptamine receptor 2A
Type:undefined
Mol. Mass.:52607.65
Organism:Homo sapiens (Human)
Description:P28223
Residue:471
BDBM50125150
NameBDBM50125150
Synonyms:1-(2-Amino-4-fluoro-phenyl)-4-(7bR,11aS)-4,5,6,7,8,9,11,11a-octahydro-7bH-7a,10-diaza-cyclohepta[jk]fluoren-10-yl-butan-1-one | CHEMBL165897
TypeSmall organic molecule
Emp. Form.C25H30FN3O
Mol. Mass.407.5236
SMILESNc1cc(F)ccc1C(=O)CCCN1CC[C@@H]2[C@H](C1)c1cccc3CCCCN2c13