Reaction Details
Target5-hydroxytryptamine receptor 2A
LigandBDBM50125172
Substrate/Competitorn/a
Meas. Tech.ChEBML_2457
Ki 2.7±n/a nM
Citation Lee, TRobichaud, AJBoyle, KELu, YRobertson, DWMiller, KJFitzgerald, LWMcElroy, JFLargent, BL Novel, highly potent, selective 5-HT2A/D2 receptor antagonists as potential atypical antipsychotics. Bioorg Med Chem Lett13:767-70 (2003) 5-hydroxytryptamine receptor 2A
Name:5-hydroxytryptamine receptor 2A
Type:undefined
Mol. Mass.:52607.65
Organism:Homo sapiens (Human)
Description:P28223
Residue:471
BDBM50125172
NameBDBM50125172
Synonyms:4-(7bS,11aR)-6,7,8,9,11,11a-Hexahydro-5H,7bH-4-thia-7a,10-diaza-cyclohepta[jk]fluoren-10-yl-1-phenyl-butan-1-one | CHEMBL350567
TypeSmall organic molecule
Emp. Form.C24H28N2OS
Mol. Mass.392.557
SMILESO=C(CCCN1CC[C@H]2[C@@H](C1)c1cccc3SCCCN2c13)c1ccccc1