Reaction Details
Target5-hydroxytryptamine receptor 2A
LigandBDBM50125177
Substrate/Competitorn/a
Meas. Tech.ChEBML_2457
Ki 0.800000±n/a nM
Citation Lee, TRobichaud, AJBoyle, KELu, YRobertson, DWMiller, KJFitzgerald, LWMcElroy, JFLargent, BL Novel, highly potent, selective 5-HT2A/D2 receptor antagonists as potential atypical antipsychotics. Bioorg Med Chem Lett13:767-70 (2003) 5-hydroxytryptamine receptor 2A
Name:5-hydroxytryptamine receptor 2A
Type:undefined
Mol. Mass.:52607.65
Organism:Homo sapiens (Human)
Description:P28223
Residue:471
BDBM50125177
NameBDBM50125177
Synonyms:CHEMBL162768 | N-[5-Fluoro-2-((7bS,11aR)-4-6,7,8,9,11,11a-hexahydro-5H,7bH-4-thia-7a,10-diaza-cyclohepta[jk]fluoren-10-yl-butyryl)-phenyl]-acetamide
TypeSmall organic molecule
Emp. Form.C26H30FN3O2S
Mol. Mass.467.599
SMILESCC(=O)Nc1cc(F)ccc1C(=O)CCCN1CC[C@H]2[C@@H](C1)c1cccc3SCCCN2c13