Reaction Details
Target5-hydroxytryptamine receptor 2A
LigandBDBM50125173
Substrate/Competitorn/a
Meas. Tech.ChEBML_2457
Ki 0.400000±n/a nM
Citation Lee, TRobichaud, AJBoyle, KELu, YRobertson, DWMiller, KJFitzgerald, LWMcElroy, JFLargent, BL Novel, highly potent, selective 5-HT2A/D2 receptor antagonists as potential atypical antipsychotics. Bioorg Med Chem Lett13:767-70 (2003) 5-hydroxytryptamine receptor 2A
Name:5-hydroxytryptamine receptor 2A
Type:undefined
Mol. Mass.:52607.65
Organism:Homo sapiens (Human)
Description:P28223
Residue:471
BDBM50125173
NameBDBM50125173
Synonyms:1-(2-Amino-4-fluoro-phenyl)-4-(7bS,11aR)-6,7,8,9,11,11a-hexahydro-5H,7bH-4-thia-7a,10-diaza-cyclohepta[jk]fluoren-10-yl-butan-1-one | CHEMBL166310
TypeSmall organic molecule
Emp. Form.C24H28FN3OS
Mol. Mass.425.562
SMILESNc1cc(F)ccc1C(=O)CCCN1CC[C@H]2[C@@H](C1)c1cccc3SCCCN2c13