Reaction Details
TargetCoagulation factor X
LigandBDBM50125240
Substrate/Competitorn/a
Meas. Tech.ChEBML_69674
Ki 1.2±n/a nM
Citation Quan, MLEllis, CDHe, MYLiauw, AYLam, PYRossi, KAKnabb, RMLuettgen, JMWright, MRWong, PCWexler, RR Nonbenzamidine isoxazoline derivatives as factor Xa inhibitors. Bioorg Med Chem Lett13:1023-8 (2003) Coagulation factor X
Name:Coagulation factor X
Type:Enzyme
Mol. Mass.:54726.60
Organism:Homo sapiens (Human)
Description:n/a
Residue:488
BDBM50125240
NameBDBM50125240
Synonyms:3-(3-Amino-4-chloro-phenyl)-5-[(thiophene-3-sulfonylamino)-methyl]-4,5-dihydro-isoxazole-5-carboxylic acid [5-(2-sulfamoyl-phenyl)-pyridin-2-yl]-amide | CHEMBL275957
TypeSmall organic molecule
Emp. Form.C26H23ClN6O6S3
Mol. Mass.647.145
SMILESNc1cc(ccc1Cl)C1=NOC(CNS(=O)(=O)c2ccsc2)(C1)C(=O)Nc1ccc(cn1)-c1ccccc1S(N)(=O)=O