Reaction Details
Target5-hydroxytryptamine receptor 7
LigandBDBM50222889
Substrate/Competitorn/a
Meas. Tech.ChEMBL_3709 (CHEMBL618161)
Ki 12±n/a nM
Citation Forbes, ITCooper, DGDodds, EKDouglas, SEGribble, ADIfe, RJLightfoot, APMeeson, MCampbell, LPColeman, TRiley, GJThomas, DR Identification of a novel series of selective 5-HT7 receptor antagonists. Bioorg Med Chem Lett13:1055-8 (2003) 5-hydroxytryptamine receptor 7
Name:5-hydroxytryptamine receptor 7
Type:G Protein-Coupled Receptor (GPCR)
Mol. Mass.:53573.08
Organism:Homo sapiens (Human)
Description:P34969
Residue:479
BDBM50222889
NameBDBM50222889
Synonyms:CHEMBL429202
TypeSmall organic molecule
Emp. Form.C23H27ClN2O2
Mol. Mass.398.926
SMILESClc1ccc(OC2CCN(CCN3CCCc4ccccc4C3=O)CC2)cc1