Reaction Details
Target5-hydroxytryptamine receptor 7
LigandBDBM50222890
Substrate/Competitorn/a
Meas. Tech.ChEMBL_3709 (CHEMBL618161)
Ki 11±n/a nM
Citation Forbes, ITCooper, DGDodds, EKDouglas, SEGribble, ADIfe, RJLightfoot, APMeeson, MCampbell, LPColeman, TRiley, GJThomas, DR Identification of a novel series of selective 5-HT7 receptor antagonists. Bioorg Med Chem Lett13:1055-8 (2003) 5-hydroxytryptamine receptor 7
Name:5-hydroxytryptamine receptor 7
Type:G Protein-Coupled Receptor (GPCR)
Mol. Mass.:53573.08
Organism:Homo sapiens (Human)
Description:P34969
Residue:479
BDBM50222890
NameBDBM50222890
Synonyms:CHEMBL9840
TypeSmall organic molecule
Emp. Form.C24H29NO2
Mol. Mass.363.4926
SMILESCOc1ccccc1C1CCN(CC2CCc3ccccc3C(=O)C2)CC1