Reaction Details
Target5-hydroxytryptamine receptor 2A
LigandBDBM50222897
Substrate/Competitorn/a
Meas. Tech.ChEMBL_2521 (CHEMBL617254)
Ki 43±n/a nM
Citation Forbes, ITCooper, DGDodds, EKDouglas, SEGribble, ADIfe, RJLightfoot, APMeeson, MCampbell, LPColeman, TRiley, GJThomas, DR Identification of a novel series of selective 5-HT7 receptor antagonists. Bioorg Med Chem Lett13:1055-8 (2003) 5-hydroxytryptamine receptor 2A
Name:5-hydroxytryptamine receptor 2A
Type:undefined
Mol. Mass.:52607.65
Organism:Homo sapiens (Human)
Description:P28223
Residue:471
BDBM50222897
NameBDBM50222897
Synonyms:CHEMBL9446
TypeSmall organic molecule
Emp. Form.C25H28FN3O2
Mol. Mass.421.5071
SMILESFc1ccc2N(C3CCN(CCN4CCCc5ccccc5C4=O)CC3)C(=O)Cc2c1