Reaction Details
Target5-hydroxytryptamine receptor 7
LigandBDBM50222899
Substrate/Competitorn/a
Meas. Tech.ChEMBL_3709 (CHEMBL618161)
Ki 2±n/a nM
Citation Forbes, ITCooper, DGDodds, EKDouglas, SEGribble, ADIfe, RJLightfoot, APMeeson, MCampbell, LPColeman, TRiley, GJThomas, DR Identification of a novel series of selective 5-HT7 receptor antagonists. Bioorg Med Chem Lett13:1055-8 (2003) 5-hydroxytryptamine receptor 7
Name:5-hydroxytryptamine receptor 7
Type:G Protein-Coupled Receptor (GPCR)
Mol. Mass.:53573.08
Organism:Homo sapiens (Human)
Description:P34969
Residue:479
BDBM50222899
NameBDBM50222899
Synonyms:CHEMBL9347
TypeSmall organic molecule
Emp. Form.C23H26FN5O
Mol. Mass.407.4838
SMILESFc1ccc2n(nnc2c1)C1CCN(CCN2CCCc3ccccc3C2=O)CC1