Reaction Details
TargetCytochrome P450 2D6
LigandBDBM50125265
Substrate/Competitorn/a
Meas. Tech.ChEBML_51742
IC50 26000±n/a nM
Citation Blackie, JABloomer, JCBrown, MJCheng, HYHammond, BHickey, DMIfe, RJLeach, CALewis, VAMacphee, CHMilliner, KJMoores, KEPinto, ILSmith, SAStansfield, IGStanway, SJTaylor, MATheobald, CJ The identification of clinical candidate SB-480848: a potent inhibitor of lipoprotein-associated phospholipase A2. Bioorg Med Chem Lett13:1067-70 (2003) Cytochrome P450 2D6
Name:Cytochrome P450 2D6
Type:Protein
Mol. Mass.:55774.82
Organism:Homo sapiens (Human)
Description:P10635
Residue:497
BDBM50125265
NameBDBM50125265
Synonyms:CHEMBL204021 | N-(2-Diethylamino-ethyl)-2-[2-(4-fluoro-benzylsulfanyl)-4-oxo-4,5,6,7-tetrahydro-cyclopentapyrimidin-1-yl]-N-(4'-trifluoromethyl-biphenyl-4-ylmethyl)-acetamide
TypeSmall organic molecule
Emp. Form.C36H38F4N4O2S
Mol. Mass.666.771
SMILESCCN(CC)CCN(Cc1ccc(cc1)-c1ccc(cc1)C(F)(F)F)C(=O)Cn1c2CCCc2c(=O)nc1SCc1ccc(F)cc1