Reaction Details
TargetPlatelet-activating factor acetylhydrolase
LigandBDBM50125272
Substrate/Competitorn/a
Meas. Tech.ChEBML_101008
IC50 0.400000±n/a nM
Citation Blackie, JABloomer, JCBrown, MJCheng, HYHammond, BHickey, DMIfe, RJLeach, CALewis, VAMacphee, CHMilliner, KJMoores, KEPinto, ILSmith, SAStansfield, IGStanway, SJTaylor, MATheobald, CJ The identification of clinical candidate SB-480848: a potent inhibitor of lipoprotein-associated phospholipase A2. Bioorg Med Chem Lett13:1067-70 (2003) Platelet-activating factor acetylhydrolase
Name:Platelet-activating factor acetylhydrolase
Type:PROTEIN
Mol. Mass.:50084.41
Organism:Homo sapiens (Human)
Description:ChEMBL_156212
Residue:441
BDBM50125272
NameBDBM50125272
Synonyms:CHEMBL10663 | N-(4'-Chloro-biphenyl-4-ylmethyl)-N-(2-diethylamino-ethyl)-2-[2-(4-fluoro-benzylsulfanyl)-4-oxo-4,5,6,7-tetrahydro-cyclopentapyrimidin-1-yl]-acetamide
TypeSmall organic molecule
Emp. Form.C35H38ClFN4O2S
Mol. Mass.633.218
SMILESCCN(CC)CCN(Cc1ccc(cc1)-c1ccc(Cl)cc1)C(=O)Cn1c2CCCc2c(=O)nc1SCc1ccc(F)cc1