Reaction Details
TargetEndothelin-1 receptor
LigandBDBM50125348
Substrate/Competitorn/a
Meas. Tech.ChEBML_65644
Ki 22±n/a nM
Citation Tellew, JEBaska, RABeyer, SMCarlson, KECornelius, LAFadnis, LGu, ZKunst, BLKowala, MCMonshizadegan, HMurugesan, NRyan, CSValentine, MTYang, YMacor, JE Discovery of 4'-[(imidazol-1-yl)methyl]biphenyl-2-sulfonamides as dual endothelin/angiotensin II receptor antagonists. Bioorg Med Chem Lett13:1093-6 (2003) Endothelin-1 receptor
Name:Endothelin-1 receptor
Type:Enzyme Catalytic Domain
Mol. Mass.:48736.88
Organism:Homo sapiens (Human)
Description:P25101
Residue:427
BDBM50125348
NameBDBM50125348
Synonyms:3-[2'-(3,4-Dimethyl-isoxazol-5-ylsulfamoyl)-2-ethoxymethyl-biphenyl-4-ylmethyl]-5-ethyl-2-propyl-3H-imidazole-4-carboxylic acid methylamide | CHEMBL12557
TypeSmall organic molecule
Emp. Form.C31H39N5O5S
Mol. Mass.593.737
SMILESCCCc1nc(CC)c(C(=O)NC)n1Cc1ccc(c(COCC)c1)-c1ccccc1S(=O)(=O)Nc1onc(C)c1C