Reaction Details
TargetEndothelin-1 receptor
LigandBDBM50125344
Substrate/Competitorn/a
Meas. Tech.ChEBML_65644
Ki 16±n/a nM
Citation Tellew, JEBaska, RABeyer, SMCarlson, KECornelius, LAFadnis, LGu, ZKunst, BLKowala, MCMonshizadegan, HMurugesan, NRyan, CSValentine, MTYang, YMacor, JE Discovery of 4'-[(imidazol-1-yl)methyl]biphenyl-2-sulfonamides as dual endothelin/angiotensin II receptor antagonists. Bioorg Med Chem Lett13:1093-6 (2003) Endothelin-1 receptor
Name:Endothelin-1 receptor
Type:Enzyme Catalytic Domain
Mol. Mass.:48736.88
Organism:Homo sapiens (Human)
Description:P25101
Residue:427
BDBM50125344
NameBDBM50125344
Synonyms:3-[2'-(3,4-Dimethyl-isoxazol-5-ylsulfamoyl)-biphenyl-4-ylmethyl]-5-ethyl-2-propyl-3H-imidazole-4-carboxylic acid methylamide | CHEMBL275523
TypeSmall organic molecule
Emp. Form.C28H33N5O4S
Mol. Mass.535.658
SMILESCCCc1nc(CC)c(C(=O)NC)n1Cc1ccc(cc1)-c1ccccc1S(=O)(=O)Nc1onc(C)c1C