Reaction Details
TargetType-1 angiotensin II receptor A/B
LigandBDBM50125355
Substrate/Competitorn/a
Meas. Tech.ChEMBL_35111 (CHEMBL649313)
Ki 16±n/a nM
Citation Tellew, JEBaska, RABeyer, SMCarlson, KECornelius, LAFadnis, LGu, ZKunst, BLKowala, MCMonshizadegan, HMurugesan, NRyan, CSValentine, MTYang, YMacor, JE Discovery of 4'-[(imidazol-1-yl)methyl]biphenyl-2-sulfonamides as dual endothelin/angiotensin II receptor antagonists. Bioorg Med Chem Lett13:1093-6 (2003) Type-1 angiotensin II receptor A/B
Name:Type-1 angiotensin II receptor A/B
Type:n/a
Mol. Mass.:n/a
Description:ASSAY_ID of ChEMBL is 901964
Components:This complex has 2 components.
Component 1
Name:Type-1 angiotensin II receptor B
Synonyms:AGTRB_RAT Agtr1 Angiotensin II AT1B Angiotensin II type 1b (AT-1b) receptor Type-1B angiotensin II receptor
Type:Enzyme Catalytic Domain
Mol. Mass.:40929.44
Organism:RAT
Description:Angiotensin II AT1B 0 RAT::P29089
Residue:359
Component 2
Name:Type-1 angiotensin II receptor A
Synonyms:AGTRA_RAT Agtr1 Angiotensin II AT1 Angiotensin II receptor (AT-1) type-1 Type-1A angiotensin II receptor
Type:Enzyme Catalytic Domain
Mol. Mass.:40910.53
Organism:RAT
Description:ANGIOTENSIN AT1 AGTR1 RAT::P25095
Residue:359
BDBM50125355
NameBDBM50125355
Synonyms:2'-Fluoro-4'-(8-oxo-2-propyl-5,6,7,8-tetrahydro-4H-cycloheptaimidazol-1-ylmethyl)-biphenyl-2-sulfonic acid (3,4-dimethyl-isoxazol-5-yl)-amide | CHEMBL12590
TypeSmall organic molecule
Emp. Form.C29H31FN4O4S
Mol. Mass.550.644
SMILESCCCc1nc2CCCCC(=O)c2n1Cc1ccc(c(F)c1)-c1ccccc1S(=O)(=O)Nc1onc(C)c1C