Reaction Details
TargetGenome polyprotein
LigandBDBM50125376
Substrate/Competitorn/a
Meas. Tech.ChEBML_143488
IC50 60±n/a nM
Citation Han, WHu, ZJiang, XWasserman, ZRDecicco, CP Glycine alpha-ketoamides as HCV NS3 protease inhibitors. Bioorg Med Chem Lett13:1111-4 (2003) Genome polyprotein
Name:Genome polyprotein
Type:Protein
Mol. Mass.:327266.82
Organism:Hepatitis C virus (HCV)
Description:P26664
Residue:3011
BDBM50125376
NameBDBM50125376
Synonyms:CHEMBL275290 {(S)-3-[(S)-3-Cyclohexyl-2-((S)-3-methyl-2-{(S)-4-methyl-2-[((S)-oxo-pyrazin-2-yl-methyl)-amino]-pentanoylamino}-pentanoylamino)-1-oxo-propylamino]-5,5-difluoro-2-oxo-pentanoylamino}-acetic acid
TypeSmall organic molecule
Emp. Form.C33H49F2N7O8
Mol. Mass.709.7811
SMILESCC[C@H](C)[C@H](NC(=O)[C@H](CC(C)C)NC(=O)c1cnccn1)C(=O)N[C@@H](CC1CCCCC1)C(=O)N[C@@H](CC(F)F)C(=O)C(=O)NCC(O)=O