Reaction Details
TargetDelta-type opioid receptor
LigandBDBM50125459
Substrate/Competitorn/a
Meas. Tech.ChEBML_145338
IC50>10000±n/a nM
Citation Semple, GAndersson, BMChhajlani, VGeorgsson, JJohansson, MJRosenquist, ASwanson, L Synthesis and Biological activity of kappa opioid receptor agonists. Part 2: preparation of 3-aryl-2-pyridone analogues generated by solution- and solid-phase parallel synthesis methods. Bioorg Med Chem Lett13:1141-5 (2003) Delta-type opioid receptor
Name:Delta-type opioid receptor
Type:G Protein-Coupled Receptor (GPCR)
Mol. Mass.:40382.98
Organism:Homo sapiens (Human)
Description:Competition binding assays were carried out using membrane preparations from transfected HN9.10 cells that constitutively expressed the delta opioid receptor.
Residue:372
BDBM50125459
NameBDBM50125459
Synonyms:5-(2,4-Dichloro-phenyl)-3-(1-phenyl-2-pyrrolidin-1-yl-ethyl)-3H-pyrimidin-4-one | CHEMBL15257
TypeSmall organic molecule
Emp. Form.C22H21Cl2N3O
Mol. Mass.414.328
SMILESClc1ccc(c(Cl)c1)-c1cncn(C(CN2CCCC2)c2ccccc2)c1=O