Reaction Details
TargetDelta-type opioid receptor
LigandBDBM50125460
Substrate/Competitorn/a
Meas. Tech.ChEBML_145338
IC50>10000±n/a nM
Citation Semple, GAndersson, BMChhajlani, VGeorgsson, JJohansson, MJRosenquist, ASwanson, L Synthesis and Biological activity of kappa opioid receptor agonists. Part 2: preparation of 3-aryl-2-pyridone analogues generated by solution- and solid-phase parallel synthesis methods. Bioorg Med Chem Lett13:1141-5 (2003) Delta-type opioid receptor
Name:Delta-type opioid receptor
Type:G Protein-Coupled Receptor (GPCR)
Mol. Mass.:40382.98
Organism:Homo sapiens (Human)
Description:Competition binding assays were carried out using membrane preparations from transfected HN9.10 cells that constitutively expressed the delta opioid receptor.
Residue:372
BDBM50125460
NameBDBM50125460
Synonyms:3-(4-Fluoro-3-methyl-phenyl)-1-[2-(3-hydroxy-pyrrolidin-1-yl)-1-phenyl-ethyl]-1H-pyridin-2-one | CHEMBL278708
TypeSmall organic molecule
Emp. Form.C24H25FN2O2
Mol. Mass.392.4659
SMILESCc1cc(ccc1F)-c1cccn(C(CN2CCC(O)C2)c2ccccc2)c1=O