Reaction Details
TargetMu-type opioid receptor
LigandBDBM50108441
Substrate/Competitorn/a
Meas. Tech.ChEMBL_148072 (CHEMBL754565)
IC50>10000±n/a nM
Citation Semple, GAndersson, BMChhajlani, VGeorgsson, JJohansson, MJRosenquist, ASwanson, L Synthesis and Biological activity of kappa opioid receptor agonists. Part 2: preparation of 3-aryl-2-pyridone analogues generated by solution- and solid-phase parallel synthesis methods. Bioorg Med Chem Lett13:1141-5 (2003) Mu-type opioid receptor
Name:Mu-type opioid receptor
Type:G Protein-Coupled Receptor (GPCR)
Mol. Mass.:44789.51
Organism:Homo sapiens (Human)
Description:P35372
Residue:400
BDBM50108441
NameBDBM50108441
Synonyms:3-Phenyl-1-(1-phenyl-2-pyrrolidin-1-yl-ethyl)-1H-pyridin-2-one | CHEMBL278268
TypeSmall organic molecule
Emp. Form.C23H24N2O
Mol. Mass.344.4495
SMILESO=c1c(cccn1C(CN1CCCC1)c1ccccc1)-c1ccccc1