Reaction Details
TargetMu-type opioid receptor
LigandBDBM50125437
Substrate/Competitorn/a
Meas. Tech.ChEBML_148072
IC50 10000±n/a nM
Citation Semple, GAndersson, BMChhajlani, VGeorgsson, JJohansson, MJRosenquist, ASwanson, L Synthesis and Biological activity of kappa opioid receptor agonists. Part 2: preparation of 3-aryl-2-pyridone analogues generated by solution- and solid-phase parallel synthesis methods. Bioorg Med Chem Lett13:1141-5 (2003) Mu-type opioid receptor
Name:Mu-type opioid receptor
Type:G Protein-Coupled Receptor (GPCR)
Mol. Mass.:44789.51
Organism:Homo sapiens (Human)
Description:P35372
Residue:400
BDBM50125437
NameBDBM50125437
Synonyms:1-(1-Phenyl-2-pyrrolidin-1-yl-ethyl)-3-(4-trifluoromethyl-phenylamino)-1H-pyridin-2-one | CHEMBL15264
TypeSmall organic molecule
Emp. Form.C24H24F3N3O
Mol. Mass.427.4621
SMILESFC(F)(F)c1ccc(Nc2cccn(C(CN3CCCC3)c3ccccc3)c2=O)cc1