Reaction Details
TargetMu-type opioid receptor
LigandBDBM50125447
Substrate/Competitorn/a
Meas. Tech.ChEBML_148072
IC50>10000±n/a nM
Citation Semple, GAndersson, BMChhajlani, VGeorgsson, JJohansson, MJRosenquist, ASwanson, L Synthesis and Biological activity of kappa opioid receptor agonists. Part 2: preparation of 3-aryl-2-pyridone analogues generated by solution- and solid-phase parallel synthesis methods. Bioorg Med Chem Lett13:1141-5 (2003) Mu-type opioid receptor
Name:Mu-type opioid receptor
Type:G Protein-Coupled Receptor (GPCR)
Mol. Mass.:44789.51
Organism:Homo sapiens (Human)
Description:P35372
Residue:400
BDBM50125447
NameBDBM50125447
Synonyms:1-(1-Phenyl-2-pyrrolidin-1-yl-ethyl)-3-(1-p-tolyl-ethylamino)-1H-pyridin-2-one | CHEMBL14784
TypeSmall organic molecule
Emp. Form.C26H31N3O
Mol. Mass.401.5438
SMILESCC(Nc1cccn(C(CN2CCCC2)c2ccccc2)c1=O)c1ccc(C)cc1