Reaction Details
TargetMu-type opioid receptor
LigandBDBM50125446
Substrate/Competitorn/a
Meas. Tech.ChEBML_148072
IC50>10000±n/a nM
Citation Semple, GAndersson, BMChhajlani, VGeorgsson, JJohansson, MJRosenquist, ASwanson, L Synthesis and Biological activity of kappa opioid receptor agonists. Part 2: preparation of 3-aryl-2-pyridone analogues generated by solution- and solid-phase parallel synthesis methods. Bioorg Med Chem Lett13:1141-5 (2003) Mu-type opioid receptor
Name:Mu-type opioid receptor
Type:G Protein-Coupled Receptor (GPCR)
Mol. Mass.:44789.51
Organism:Homo sapiens (Human)
Description:P35372
Residue:400
BDBM50125446
NameBDBM50125446
Synonyms:1-[1-(4-Diethylamino-phenyl)-2-pyrrolidin-1-yl-ethyl]-3-(4-trifluoromethyl-phenyl)-1H-pyridin-2-one | CHEMBL277834
TypeSmall organic molecule
Emp. Form.C28H32F3N3O
Mol. Mass.483.5684
SMILESCCN(CC)c1ccc(cc1)C(CN1CCCC1)n1cccc(-c2ccc(cc2)C(F)(F)F)c1=O