Reaction Details
TargetKappa-type opioid receptor
LigandBDBM50125461
Substrate/Competitorn/a
Meas. Tech.ChEBML_145114
IC50 57±n/a nM
Citation Semple, GAndersson, BMChhajlani, VGeorgsson, JJohansson, MJRosenquist, ASwanson, L Synthesis and Biological activity of kappa opioid receptor agonists. Part 2: preparation of 3-aryl-2-pyridone analogues generated by solution- and solid-phase parallel synthesis methods. Bioorg Med Chem Lett13:1141-5 (2003) Kappa-type opioid receptor
Name:Kappa-type opioid receptor
Type:G Protein-Coupled Receptor (GPCR)
Mol. Mass.:42648.76
Organism:Homo sapiens (Human)
Description:P41145
Residue:380
BDBM50125461
NameBDBM50125461
Synonyms:6-{1-[2-Oxo-3-(4-trifluoromethyl-phenyl)-2H-pyridin-1-yl]-2-pyrrolidin-1-yl-ethyl}-4H-benzo[1,4]oxazin-3-one | CHEMBL15462
TypeSmall organic molecule
Emp. Form.C26H24F3N3O3
Mol. Mass.483.4823
SMILESFC(F)(F)c1ccc(cc1)-c1cccn(C(CN2CCCC2)c2ccc3OCC(=O)Nc3c2)c1=O