Reaction Details
TargetKappa-type opioid receptor
LigandBDBM50125463
Substrate/Competitorn/a
Meas. Tech.ChEBML_145114
IC50 9.8±n/a nM
Citation Semple, GAndersson, BMChhajlani, VGeorgsson, JJohansson, MJRosenquist, ASwanson, L Synthesis and Biological activity of kappa opioid receptor agonists. Part 2: preparation of 3-aryl-2-pyridone analogues generated by solution- and solid-phase parallel synthesis methods. Bioorg Med Chem Lett13:1141-5 (2003) Kappa-type opioid receptor
Name:Kappa-type opioid receptor
Type:G Protein-Coupled Receptor (GPCR)
Mol. Mass.:42648.76
Organism:Homo sapiens (Human)
Description:P41145
Residue:380
BDBM50125463
NameBDBM50125463
Synonyms:3-(2,6-Dimethoxy-phenyl)-1-[2-(3-hydroxy-pyrrolidin-1-yl)-1-phenyl-ethyl]-1H-pyridin-2-one | CHEMBL417260
TypeSmall organic molecule
Emp. Form.C25H28N2O4
Mol. Mass.420.5008
SMILESCOc1cccc(OC)c1-c1cccn(C(CN2CCC(O)C2)c2ccccc2)c1=O