Reaction Details
TargetGenome polyprotein
LigandBDBM50125474
Substrate/Competitorn/a
Meas. Tech.ChEBML_79051
IC50 2±n/a nM
Citation Zhang, XSchmitt, ACJiang, WWasserman, ZDecicco, CP Design and synthesis of potent, non-peptide inhibitors of HCV NS3 protease. Bioorg Med Chem Lett13:1157-60 (2003) Genome polyprotein
Name:Genome polyprotein
Type:Protein
Mol. Mass.:67067.41
Organism:Hepatitis C virus
Description:A3EZI9
Residue:631
BDBM50125474
NameBDBM50125474
Synonyms:(6S,8R)-1-Chloro-8-(3-naphthalen-1-yl-propyl)-4-oxo-3-(3-trifluoromethyl-benzylamino)-4,6,7,8-tetrahydro-pyrrolo[1,2-a]pyrazine-6-carboxylic acid [(R)-1-((R)-2,9,9-trimethyl-3,5-dioxa-4-bora-tricyclo[6.1.1.0*2,6*]dec-4-yl)-but-3-enyl]-amide | CHEMBL278710
TypeSmall organic molecule
Emp. Form.C43H47BClF3N4O4
Mol. Mass.787.117
SMILESCC1(C)C2CC1[C@@]1(C)OB(OC1C2)[C@H](CC=C)NC(=O)[C@@H]1C[C@@H](CCCc2cccc3ccccc23)c2c(Cl)nc(NCc3cccc(c3)C(F)(F)F)c(=O)n12