Reaction Details
TargetMelatonin receptor type 1B
LigandBDBM9019
Substrate/Competitorn/a
Meas. Tech.ChEBML_105255
IC50 0.300000±n/a nM
Citation Mattson, RJCatt, JDKeavy, DSloan, CPEpperson, JGao, QHodges, DBIben, LMahle, CDRyan, EYocca, FD Indanyl piperazines as melatonergic MT2 selective agents. Bioorg Med Chem Lett13:1199-202 (2003) Melatonin receptor type 1B
Name:Melatonin receptor type 1B
Type:Enzyme
Mol. Mass.:40203.54
Organism:Homo sapiens (Human)
Description:P49286
Residue:362
BDBM9019
NameBDBM9019
Synonyms:CHEMBL45 N-[2-(5-methoxy-1H-indol-3-yl)ethyl]acetamide
TypeSmall organic molecule
Emp. Form.C13H16N2O2
Mol. Mass.232.2783
SMILESCOc1ccc2[nH]cc(CCNC(C)=O)c2c1