Reaction Details
TargetMelatonin receptor type 1A
LigandBDBM50035179
Substrate/Competitorn/a
Meas. Tech.ChEMBL_105097 (CHEMBL714104)
Ki 0.06±n/a nM
Citation Descamps-François, CYous, SChavatte, PAudinot, VBonnaud, ABoutin, JADelagrange, PBennejean, CRenard, PLesieur, D Design and synthesis of naphthalenic dimers as selective MT1 melatoninergic ligands. J Med Chem46:1127-9 (2003) 
 
Melatonin receptor type 1A
Name:Melatonin receptor type 1A
Type:Enzyme
Mol. Mass.:39392.94
Organism:Homo sapiens (Human)
Description:P48039
Residue:350
BDBM50035179
NameBDBM50035179
Synonyms:Agomelatine N-[2-(7-Methoxy-naphthalen-1-yl)-ethyl]-acetamide S 20098 US11091445, Compound code IA2-76
TypeSmall organic molecule
Emp. Form.C15H17NO2
Mol. Mass.243.301
SMILESCOc1ccc2cccc(CCNC(C)=O)c2c1