Reaction Details
TargetMelatonin receptor type 1A
LigandBDBM50125754
Substrate/Competitorn/a
Meas. Tech.ChEMBL_105097 (CHEMBL714104)
Ki 0.5±n/a nM
Citation Descamps-François, CYous, SChavatte, PAudinot, VBonnaud, ABoutin, JADelagrange, PBennejean, CRenard, PLesieur, D Design and synthesis of naphthalenic dimers as selective MT1 melatoninergic ligands. J Med Chem46:1127-9 (2003) 
 
Melatonin receptor type 1A
Name:Melatonin receptor type 1A
Type:Enzyme
Mol. Mass.:39392.94
Organism:Homo sapiens (Human)
Description:P48039
Residue:350
BDBM50125754
NameBDBM50125754
Synonyms:CHEMBL429392 N-[2-(7-{3-[8-(2-Acetylamino-ethyl)-naphthalen-2-yloxy]-propoxy}-naphthalen-1-yl)-ethyl]-acetamide
TypeSmall organic molecule
Emp. Form.C31H34N2O4
Mol. Mass.498.6127
SMILESCC(=O)NCCc1cccc2ccc(OCCCOc3ccc4cccc(CCNC(C)=O)c4c3)cc12