Reaction Details
TargetMelatonin receptor type 1B
LigandBDBM9019
Substrate/Competitorn/a
Meas. Tech.ChEMBL_105248 (CHEMBL709923)
EC50 0.49±n/a nM
Citation Descamps-François, CYous, SChavatte, PAudinot, VBonnaud, ABoutin, JADelagrange, PBennejean, CRenard, PLesieur, D Design and synthesis of naphthalenic dimers as selective MT1 melatoninergic ligands. J Med Chem46:1127-9 (2003) 
 
Melatonin receptor type 1B
Name:Melatonin receptor type 1B
Type:Enzyme
Mol. Mass.:40203.54
Organism:Homo sapiens (Human)
Description:P49286
Residue:362
BDBM9019
NameBDBM9019
Synonyms:CHEMBL45 N-[2-(5-methoxy-1H-indol-3-yl)ethyl]acetamide
TypeSmall organic molecule
Emp. Form.C13H16N2O2
Mol. Mass.232.2783
SMILESCOc1ccc2[nH]cc(CCNC(C)=O)c2c1