Reaction Details
TargetCarboxylic ester hydrolase
LigandBDBM8961
Substrate/Competitorn/a
Meas. Tech.ChEMBL_41577 (CHEMBL654871)
IC50 240±n/a nM
Citation Barreiro, EJCamara, CAVerli, HBrazil-Más, LCastro, NGCintra, WMAracava, YRodrigues, CRFraga, CA Design, synthesis, and pharmacological profile of novel fused pyrazolo[4,3-d]pyridine and pyrazolo[3,4-b][1,8]naphthyridine isosteres: a new class of potent and selective acetylcholinesterase inhibitors. J Med Chem46:1144-52 (2003) 
 
Carboxylic ester hydrolase
Name:Carboxylic ester hydrolase
Type:Enzyme
Mol. Mass.:67776.22
Organism:Rattus norvegicus (rat)
Description:n/a
Residue:597
BDBM8961
NameBDBM8961
Synonyms:1,2,3,4-tetrahydro-9-acridinamine 9-THA CHEMBL1337960 Cognex Tracine cid_1935 | tacrine.HCl
TypeSmall organic molecule
Emp. Form.C13H14N2
Mol. Mass.198.2637
SMILESNc1c2CCCCc2nc2ccccc12