Reaction Details
TargetPolymerase acidic protein
LigandBDBM50015184
Substrate/Competitorn/a
Meas. Tech.ChEMBL_157581 (CHEMBL763331)
IC50>500000±n/a nM
Citation Parkes, KEErmert, PFässler, JIves, JMartin, JAMerrett, JHObrecht, DWilliams, GKlumpp, K Use of a pharmacophore model to discover a new class of influenza endonuclease inhibitors. J Med Chem46:1153-64 (2003) 
 
Polymerase acidic protein
Name:Polymerase acidic protein
Type:PROTEIN
Mol. Mass.:82573.84
Organism:Hepatitis C virus
Description:ChEMBL_64976
Residue:716
BDBM50015184
NameBDBM50015184
Synonyms:BENZHYDROXAMIC ACID CHEMBL16300 N-hydroxybenzamide | benzoyl hydroxamic acid
TypeSmall organic molecule
Emp. Form.C7H7NO2
Mol. Mass.137.136
SMILESONC(=O)c1ccccc1