Reaction Details
TargetMu-type opioid receptor
LigandBDBM50125999
Substrate/Competitorn/a
Meas. Tech.ChEBML_148834
Ki 0.002050±n/a nM
Citation Ambo, ANiizuma, HSasaki, AKohara, HSasaki, Y Dermorphin tetrapeptide analogues with 2',6'-dimethylphenylalanine (Dmp) substituted for aromatic amino acids have high mu opioid receptor binding and biological activities. Bioorg Med Chem Lett13:1269-72 (2003) Mu-type opioid receptor
Name:Mu-type opioid receptor
Type:G Protein-Coupled Receptor (GPCR)
Mol. Mass.:44503.11
Organism:Rattus norvegicus (rat)
Description:Competition binding assays were carried out using membrane preparations from transfected HN9.10 cells that constitutively expressed the mu opioid receptor.
Residue:398
BDBM50125999
NameBDBM50125999
Synonyms:(R)-2-[(S)-2-Amino-3-(4-hydroxy-2,6-dimethyl-phenyl)-propionylamino]-5-guanidino-pentanoic acid [(S)-1-(2-carbamoyl-ethylcarbamoyl)-2-phenyl-ethyl]-amide | CHEMBL23362
TypeSmall organic molecule
Emp. Form.C29H42N8O5
Mol. Mass.582.6944
SMILESCc1cc(O)cc(C)c1C[C@H](N)C(=O)N[C@H](CCCNC(N)=N)C(=O)N[C@@H](Cc1ccccc1)C(=O)NCCC(N)=O