Reaction Details
TargetDelta-type opioid receptor
LigandBDBM50126003
Substrate/Competitorn/a
Meas. Tech.ChEBML_145759
IC50 28±n/a nM
Citation Ambo, ANiizuma, HSasaki, AKohara, HSasaki, Y Dermorphin tetrapeptide analogues with 2',6'-dimethylphenylalanine (Dmp) substituted for aromatic amino acids have high mu opioid receptor binding and biological activities. Bioorg Med Chem Lett13:1269-72 (2003) Delta-type opioid receptor
Name:Delta-type opioid receptor
Type:Enzyme Catalytic Domain
Mol. Mass.:40577.25
Organism:MOUSE
Description:P32300
Residue:372
BDBM50126003
NameBDBM50126003
Synonyms:(R)-2-[(S)-2-Amino-3-(4-hydroxy-phenyl)-propionylamino]-5-guanidino-pentanoic acid [(S)-1-(2-carbamoyl-ethylcarbamoyl)-2-(2,6-dimethyl-phenyl)-ethyl]-amide | CHEMBL23836
TypeSmall organic molecule
Emp. Form.C29H42N8O5
Mol. Mass.582.6944
SMILESCc1cccc(C)c1C[C@H](NC(=O)[C@@H](CCCNC(N)=N)NC(=O)[C@@H](N)Cc1ccc(O)cc1)C(=O)NCCC(N)=O