Reaction Details
TargetGeranylgeranyl transferase type-1 subunit beta
LigandBDBM50126026
Substrate/Competitorn/a
Meas. Tech.ChEBML_71792
IC50 5600±n/a nM
Citation Lin, NHWang, LCohen, JGu, WZFrost, DZhang, HRosenberg, SSham, H Synthesis and biological evaluation of 4-[3-biphenyl-2-yl-1-hydroxy-1-(3-methyl-3H-imidazol-4-yl)-prop-2-ynyl]-1-yl-benzonitrile as novel farnesyltransferase inhibitor. Bioorg Med Chem Lett13:1293-6 (2003) Geranylgeranyl transferase type-1 subunit beta
Name:Geranylgeranyl transferase type-1 subunit beta
Type:n/a
Mol. Mass.:42369.84
Organism:Homo sapiens (Human)
Description:n/a
Residue:377
BDBM50126026
NameBDBM50126026
Synonyms:3-Benzo[1,3]dioxol-5-yl-4-[3-(4-cyano-phenyl)-3-hydroxy-3-(3-methyl-3H-imidazol-4-yl)-prop-1-ynyl]-benzonitrile | CHEMBL25620
TypeSmall organic molecule
Emp. Form.C28H18N4O3
Mol. Mass.458.4675
SMILESCn1cncc1C(O)(C#Cc1ccc(cc1-c1ccc2OCOc2c1)C#N)c1ccc(cc1)C#N