Reaction Details
TargetGeranylgeranyl transferase type-1 subunit beta
LigandBDBM50126033
Substrate/Competitorn/a
Meas. Tech.ChEBML_71792
IC50 430±n/a nM
Citation Lin, NHWang, LCohen, JGu, WZFrost, DZhang, HRosenberg, SSham, H Synthesis and biological evaluation of 4-[3-biphenyl-2-yl-1-hydroxy-1-(3-methyl-3H-imidazol-4-yl)-prop-2-ynyl]-1-yl-benzonitrile as novel farnesyltransferase inhibitor. Bioorg Med Chem Lett13:1293-6 (2003) Geranylgeranyl transferase type-1 subunit beta
Name:Geranylgeranyl transferase type-1 subunit beta
Type:n/a
Mol. Mass.:42369.84
Organism:Homo sapiens (Human)
Description:n/a
Residue:377
BDBM50126033
NameBDBM50126033
Synonyms:6-[3-(4-Cyano-phenyl)-3-hydroxy-3-(3-methyl-3H-imidazol-4-yl)-prop-1-ynyl]-3'-trifluoromethoxy-biphenyl-3-carbonitrile | CHEMBL24123
TypeSmall organic molecule
Emp. Form.C28H17F3N4O2
Mol. Mass.498.4554
SMILESCn1cncc1C(O)(C#Cc1ccc(cc1-c1cccc(OC(F)(F)F)c1)C#N)c1ccc(cc1)C#N