Reaction Details
TargetGeranylgeranyl transferase type-1 subunit beta
LigandBDBM50126043
Substrate/Competitorn/a
Meas. Tech.ChEBML_71792
IC50 92±n/a nM
Citation Lin, NHWang, LCohen, JGu, WZFrost, DZhang, HRosenberg, SSham, H Synthesis and biological evaluation of 4-[3-biphenyl-2-yl-1-hydroxy-1-(3-methyl-3H-imidazol-4-yl)-prop-2-ynyl]-1-yl-benzonitrile as novel farnesyltransferase inhibitor. Bioorg Med Chem Lett13:1293-6 (2003) Geranylgeranyl transferase type-1 subunit beta
Name:Geranylgeranyl transferase type-1 subunit beta
Type:n/a
Mol. Mass.:42369.84
Organism:Homo sapiens (Human)
Description:n/a
Residue:377
BDBM50126043
NameBDBM50126043
Synonyms:4-[3-(3-Amino-phenyl)-1-hydroxy-1-(3-methyl-3H-imidazol-4-yl)-prop-2-ynyl]-2-naphthalen-1-yl-benzonitrile | CHEMBL418018
TypeSmall organic molecule
Emp. Form.C30H22N4O
Mol. Mass.454.5219
SMILESCn1cncc1C(O)(C#Cc1cccc(N)c1)c1ccc(C#N)c(c1)-c1cccc2ccccc12