Reaction Details
TargetGeranylgeranyl transferase type-1 subunit beta
LigandBDBM50126038
Substrate/Competitorn/a
Meas. Tech.ChEBML_71792
IC50 1800±n/a nM
Citation Lin, NHWang, LCohen, JGu, WZFrost, DZhang, HRosenberg, SSham, H Synthesis and biological evaluation of 4-[3-biphenyl-2-yl-1-hydroxy-1-(3-methyl-3H-imidazol-4-yl)-prop-2-ynyl]-1-yl-benzonitrile as novel farnesyltransferase inhibitor. Bioorg Med Chem Lett13:1293-6 (2003) Geranylgeranyl transferase type-1 subunit beta
Name:Geranylgeranyl transferase type-1 subunit beta
Type:n/a
Mol. Mass.:42369.84
Organism:Homo sapiens (Human)
Description:n/a
Residue:377
BDBM50126038
NameBDBM50126038
Synonyms:5-[1-Hydroxy-1-(3-methyl-3H-imidazol-4-yl)-3-phenyl-propyl]-2'-methyl-biphenyl-2-carbonitrile | CHEMBL26492
TypeSmall organic molecule
Emp. Form.C27H25N3O
Mol. Mass.407.5069
SMILESCc1ccccc1-c1cc(ccc1C#N)C(O)(CCc1ccccc1)c1cncn1C