Reaction Details
TargetB2 bradykinin receptor
LigandBDBM50126250
Substrate/Competitorn/a
Meas. Tech.ChEBML_40424
Ki 76±n/a nM
Citation Youngman, MACarson, JRLee, JSDax, SLZhang, SPColburn, RWStone, DJCodd, EEJetter, MC Synthesis and structure--activity relationships of aroylpyrrole alkylamide bradykinin (B2) antagonists. Bioorg Med Chem Lett13:1341-4 (2003) B2 bradykinin receptor
Name:B2 bradykinin receptor
Type:Enzyme Catalytic Domain
Mol. Mass.:44467.17
Organism:Homo sapiens (Human)
Description:B2 BRADYKININ BDKRB2 HUMAN::P30411
Residue:391
BDBM50126250
NameBDBM50126250
Synonyms:CHEMBL26192 | N-[2,4-Dichloro-3-(2-methyl-quinolin-8-yloxymethyl)-phenyl]-N-methyl-2-[1-methyl-5-(4-sulfamoyl-benzoyl)-1H-pyrrol-2-yl]-acetamide
TypeSmall organic molecule
Emp. Form.C32H28Cl2N4O5S
Mol. Mass.651.56
SMILESCN(C(=O)Cc1ccc(C(=O)c2ccc(cc2)S(N)(=O)=O)n1C)c1ccc(Cl)c(COc2cccc3ccc(C)nc23)c1Cl