Reaction Details
TargetB2 bradykinin receptor
LigandBDBM50126263
Substrate/Competitorn/a
Meas. Tech.ChEBML_40424
Ki 29±n/a nM
Citation Youngman, MACarson, JRLee, JSDax, SLZhang, SPColburn, RWStone, DJCodd, EEJetter, MC Synthesis and structure--activity relationships of aroylpyrrole alkylamide bradykinin (B2) antagonists. Bioorg Med Chem Lett13:1341-4 (2003) B2 bradykinin receptor
Name:B2 bradykinin receptor
Type:Enzyme Catalytic Domain
Mol. Mass.:44467.17
Organism:Homo sapiens (Human)
Description:B2 BRADYKININ BDKRB2 HUMAN::P30411
Residue:391
BDBM50126263
NameBDBM50126263
Synonyms:2-[1-Butyl-5-(4-cyano-benzoyl)-1H-pyrrol-2-yl]-N-[2,4-dichloro-3-(2-methyl-quinolin-8-yloxymethyl)-phenyl]-N-methyl-acetamide | CHEMBL286520
TypeSmall organic molecule
Emp. Form.C36H32Cl2N4O3
Mol. Mass.639.57
SMILESCCCCn1c(CC(=O)N(C)c2ccc(Cl)c(COc3cccc4ccc(C)nc34)c2Cl)ccc1C(=O)c1ccc(cc1)C#N