Reaction Details
TargetProthrombin
LigandBDBM50126296
Substrate/Competitorn/a
Meas. Tech.ChEBML_208518
Ki 3.6±n/a nM
Citation Burgey, CSRobinson, KALyle, TANantermet, PGSelnick, HGIsaacs, RCLewis, SDLucas, BJKrueger, JASingh, RMiller-Stein, CWhite, RBWong, BLyle, EAStranieri, MTCook, JJMcMasters, DRPellicore, JMPal, SWallace, AAClayton, FCBohn, DWelsh, DCLynch, JJYan, YChen, ZKuo, LGardell, SJShafer, JAVacca, JP Pharmacokinetic optimization of 3-amino-6-chloropyrazinone acetamide thrombin inhibitors. Implementation of P3 pyridine N-oxides to deliver an orally bioavailable series containing P1 N-benzylamides. Bioorg Med Chem Lett13:1353-7 (2003) Prothrombin
Name:Prothrombin
Type:Protein
Mol. Mass.:70029.57
Organism:Homo sapiens (Human)
Description:P00734
Residue:622
BDBM50126296
NameBDBM50126296
Synonyms:2-{6-Chloro-3-[2,2-difluoro-2-(1-oxy-pyridin-2-yl)-ethylamino]-2-oxo-2H-pyrazin-1-yl}-N-(2-trifluoromethyl-benzyl)-acetamide | CHEMBL284225
TypeSmall organic molecule
Emp. Form.C21H17ClF5N5O3
Mol. Mass.517.836
SMILES[O-][n+]1ccccc1C(F)(F)CNc1ncc(Cl)n(CC(=O)NCc2ccccc2C(F)(F)F)c1=O