Reaction Details
TargetProthrombin
LigandBDBM50126305
Substrate/Competitorn/a
Meas. Tech.ChEBML_208518
Ki 4.8±n/a nM
Citation Burgey, CSRobinson, KALyle, TANantermet, PGSelnick, HGIsaacs, RCLewis, SDLucas, BJKrueger, JASingh, RMiller-Stein, CWhite, RBWong, BLyle, EAStranieri, MTCook, JJMcMasters, DRPellicore, JMPal, SWallace, AAClayton, FCBohn, DWelsh, DCLynch, JJYan, YChen, ZKuo, LGardell, SJShafer, JAVacca, JP Pharmacokinetic optimization of 3-amino-6-chloropyrazinone acetamide thrombin inhibitors. Implementation of P3 pyridine N-oxides to deliver an orally bioavailable series containing P1 N-benzylamides. Bioorg Med Chem Lett13:1353-7 (2003) Prothrombin
Name:Prothrombin
Type:Protein
Mol. Mass.:70029.57
Organism:Homo sapiens (Human)
Description:P00734
Residue:622
BDBM50126305
NameBDBM50126305
Synonyms:2-[6-Chloro-3-(2,2-difluoro-2-pyridin-2-yl-ethylamino)-2-oxo-2H-pyrazin-1-yl]-N-(2-fluoro-benzyl)-acetamide | CHEMBL29656
TypeSmall organic molecule
Emp. Form.C20H17ClF3N5O2
Mol. Mass.451.829
SMILESFc1ccccc1CNC(=O)Cn1c(Cl)cnc(NCC(F)(F)c2ccccn2)c1=O