Reaction Details
TargetTyrosine-protein kinase SYK
LigandBDBM50126443
Substrate/Competitorn/a
Meas. Tech.ChEBML_201611
IC50 34±n/a nM
Citation Cywin, CLZhao, BPMcNeil, DWHrapchak, MProkopowicz, ASGoldberg, DRMorwick, TMGao, AJakes, SKashem, MMagolda, RLSoll, RMPlayer, MRBobko, MARinker, JDesJarlais, RLWinters, MP Discovery and SAR of novel Naphthyridines as potent inhibitors of spleen tyrosine kinase (SYK). Bioorg Med Chem Lett13:1415-8 (2003) Tyrosine-protein kinase SYK
Name:Tyrosine-protein kinase SYK
Type:Enzyme
Mol. Mass.:72079.99
Organism:Homo sapiens (Human)
Description:P43405
Residue:635
BDBM50126443
NameBDBM50126443
Synonyms:CHEMBL30678 N1-(7-(4-(dimethylamino)phenyl)-1,6-naphthyridin-5-yl)propane-1,3-diamine
TypeSmall organic molecule
Emp. Form.C19H23N5
Mol. Mass.321.4194
SMILESCN(C)c1ccc(cc1)-c1cc2ncccc2c(NCCCN)n1