Reaction Details
TargetTyrosine-protein kinase SYK
LigandBDBM50223191
Substrate/Competitorn/a
Meas. Tech.ChEMBL_201611 (CHEMBL807574)
IC50>116000±n/a nM
Citation Cywin, CLZhao, BPMcNeil, DWHrapchak, MProkopowicz, ASGoldberg, DRMorwick, TMGao, AJakes, SKashem, MMagolda, RLSoll, RMPlayer, MRBobko, MARinker, JDesJarlais, RLWinters, MP Discovery and SAR of novel Naphthyridines as potent inhibitors of spleen tyrosine kinase (SYK). Bioorg Med Chem Lett13:1415-8 (2003) Tyrosine-protein kinase SYK
Name:Tyrosine-protein kinase SYK
Type:Enzyme
Mol. Mass.:72079.99
Organism:Homo sapiens (Human)
Description:P43405
Residue:635
BDBM50223191
NameBDBM50223191
Synonyms:CHEMBL30981
TypeSmall organic molecule
Emp. Form.C15H22N4
Mol. Mass.258.362
SMILESCC(C)(C)c1cc2ncccc2c(NCCCN)n1